{"text_format":"1","workbook":"xlsx","n_sheets":6,"sheets":["ENG","Vær del.","Fakturering","Faktura","Dato slet ikke","opslag slet ikke"],"not_rendered":{"charts":0,"images":2,"macros":1,"external_links":0,"defined_names":8,"comments":4,"pivot_tables":0},"unopened":[],"bounds":{"document_bytes":16777216,"sheet_cells":100000,"rows_first":2000,"rows_last":500,"rows_between":2000,"halvings":0,"cell_chars":16384,"cell_head_chars":4096},"cells_cut":0,"cells_raw":0,"read":"whole","date_system":"1900"}

{"sheet":"ENG","index":0,"n_rows":93,"n_cols":10,"rows_kept":93,"cut":false,"hidden":false,"merged":[[78,1,78,3],[79,1,79,3],[80,1,80,3],[81,1,81,3],[82,1,82,3],[73,1,73,3],[74,1,74,3],[75,1,75,3],[76,1,76,3],[77,1,77,3],[85,1,85,9],[89,1,89,9],[93,1,93,9],[36,1,43,9],[62,6,62,7],[63,4,63,5],[63,6,63,7],[58,4,58,5],[58,6,58,7],[59,4,59,5],[59,6,59,7],[60,4,60,5],[60,6,60,7],[48,0,48,9],[49,0,49,9],[50,0,50,9],[0,8,0,9],[66,1,66,3],[66,4,66,5],[66,6,66,7],[67,1,67,3],[67,4,67,5],[67,6,67,7],[64,1,64,3],[64,4,64,5],[64,6,64,7],[65,1,65,3],[65,4,65,5],[65,6,65,7],[61,4,61,5],[61,6,61,7],[62,4,62,5],[51,0,51,9],[52,0,52,9],[57,4,57,5],[57,6,57,7],[30,1,30,9],[31,1,31,9],[32,1,32,9],[33,1,33,9],[46,0,46,9],[25,1,25,9],[1,0,1,9],[2,0,2,9],[6,0,6,9],[8,1,8,3],[17,1,17,9],[18,1,18,9],[20,1,20,9],[21,1,21,9],[22,1,22,9],[24,1,24,9],[11,1,11,9],[58,1,58,3],[59,1,59,3],[60,1,60,3],[63,1,63,3],[62,1,62,3],[61,1,61,3]]}
[null,null,null,null,null,null,null,null,"P.O. Box 570, DK-3900 Nuuk, Greenland\nPhone:   +299 36 12 00 \nFax:  +299 36 12 12"]
["Application for logistics support\nGreenland Institute of Natural Resources\n"]
[]
["Reserved for GINR (Booking number)"]
[{"$f":"'Vær del.'!A5","v":0}]
[]
["Basic information"]
["*1) Date of application (DD-MM-YYYY)",null,null,null,null,"*2) GINR / GCRC project number – if available"]
[]
[]
["*3) Project title "]
[]
[]
["*4) Affiliated contact person GINR (Greenland Institute of Natural Resources) :"]
[]
[]
["*5) Invoice address",null,null,null,"Payment"]
["Department"]
["Responsible"]
["Street name"]
{"$rows_left_out":74}
{"sheet":"Vær del.","index":1,"n_rows":60,"n_cols":7,"rows_kept":60,"cut":false,"hidden":true,"merged":[[34,3,34,6],[35,3,35,6],[34,0,34,2],[35,0,35,2],[54,0,54,6],[53,0,53,6],[49,0,49,6],[50,2,50,6],[51,2,51,6],[52,2,52,6],[4,2,4,4],[33,0,33,6],[37,0,37,2],[47,0,47,2],[46,0,46,2],[45,0,45,2],[44,0,44,2],[43,0,43,2],[42,0,42,2],[41,0,41,2],[40,0,40,2],[39,0,39,2],[38,0,38,2],[23,1,23,6],[22,0,22,6],[31,1,31,6],[30,1,30,6],[29,1,29,6],[28,1,28,6],[27,1,27,6],[26,1,26,6],[25,1,25,6],[24,1,24,6],[20,1,20,3],[19,1,19,3],[18,1,18,3],[17,1,17,3],[16,1,16,3],[11,4,11,5],[10,4,10,5],[12,4,12,5],[13,4,13,5],[14,4,14,5],[9,0,9,6],[5,0,5,6],[6,0,6,6],[7,1,7,5],[20,4,20,5],[10,1,10,3],[11,1,11,3],[12,1,12,3],[15,1,15,3],[14,1,14,3],[13,1,13,3],[15,4,15,5],[16,4,16,5],[17,4,17,5],[18,4,18,5],[19,4,19,5]]}
[]
[]
[]
[]
[null,"Bookingnr.: "]
["Ansvarlig GN-vært"]
["Projektleder / Principal investigator"]
[null,{"$f":"ENG!B15","v":0}]
[]
["Bruger/gæst"]
["Nr.","Navn",null,null,"E-mail",null,"Tlf"]
[1,{"$f":"ENG!B59","v":0},null,null,{"$f":"ENG!E59","v":0},null,{"$f":"ENG!G59","v":0}]
[2,{"$f":"ENG!B60","v":0},null,null,{"$f":"ENG!E60","v":0},null,{"$f":"ENG!G60","v":0}]
[3,{"$f":"ENG!B61","v":0},null,null,{"$f":"ENG!E61","v":0},null,{"$f":"ENG!G61","v":0}]
[4,{"$f":"ENG!B62","v":0},null,null,{"$f":"ENG!E62","v":0},null,{"$f":"ENG!G62","v":0}]
[5,{"$f":"ENG!B63","v":0},null,null,{"$f":"ENG!E63","v":0},null,{"$f":"ENG!G63","v":0}]
[6,{"$f":"ENG!B64","v":0},null,null,{"$f":"ENG!E64","v":0},null,{"$f":"ENG!G64","v":0}]
[7,{"$f":"ENG!B65","v":0},null,null,{"$f":"ENG!E65","v":0},null,{"$f":"ENG!G65","v":0}]
[8,{"$f":"ENG!B66","v":0},null,null,{"$f":"ENG!E66","v":0},null,{"$f":"ENG!G66","v":0}]
[9,{"$f":"ENG!B67","v":0},null,null,{"$f":"ENG!E67","v":0},null,{"$f":"ENG!G67","v":0}]
{"$rows_left_out":41}
{"sheet":"Fakturering","index":2,"n_rows":32,"n_cols":26,"rows_kept":32,"cut":false,"hidden":true,"merged":[[29,28,29,30],[29,32,29,34],[30,1,30,5],[30,7,30,9],[31,1,34,5],[31,7,31,13],[32,7,32,13]]}
["Student",null,null,null,null,null,null,null,null,null,null,"Projekt nr:",{"$f":"ENG!H9","v":0},{"$f":"ENG!F9","v":0}]
["vakantbolig:",null,{"$f":"B2","v":0},null,null,null,null,null,null,null," "]
["Logi",null,"Bolig","Nr.","Pris","Ankomst dato",null,"Afrejse dato","Antal dag",null,"Rengøring","Oprind.beløb","Max","pris i alt (inkl.reng)"]
[{"$f":"'Vær del.'!A39:B39","v":0},null,{"$f":"'Vær del.'!D39","v":0},{"$f":"'Vær del.'!E39","v":0},{"$f":"IF(C4=\"FV\",400,0)+IF(C4=\"FL2\",500,0)+IF(C4=\"FL3\",650,0)+IF(C4=\"FL4\",800,0)+IF(C4=\"BIO\",400,0)+IF(C4=\"NBFL\",500,0)","v":0},{"$f":"'Vær del.'!F39","v":"00:00:00"},null,{"$f":"'Vær del.'!G39","v":"00:00:00"},{"$f":"H4-F4","v":0},null,{"$f":"IF(C4=\"NBFL\",500,0+IF(C4=\"FV\",300,0+IF(C4=\"FL2\",1500,0+IF(C4=\"FL3\",1500,0+IF(C4=\"FL4\",1500,0+IF(C4=\"BIO\",400,0))))))","v":0},{"$f":"E4*I4","v":0},{"$f":"VLOOKUP(Fakturering!I4,'opslag slet ikke'!$A$2:$S$361,IF(Fakturering!C4=\"FV\",\"4\",IF(Fakturering!C4=\"FL2\",\"7\",IF(Fakturering!C4=\"FL3\",\"10\",IF(Fakturering!C4=\"FL4\",\"13\",IF(Fakturering!C4=\"NBFL\",\"16\",IF(Fakturering!C4=\"BIO\",\"19\",\"0\")))))),FALSE)","v":{"$error":"#N/A"}},{"$f":"M4+K4","v":{"$error":"#N/A"}},"Kredit:",2110,"/",84,"-","0",{"$f":"IF(C4=\"FV\",8,0+IF(C4=\"FL2\",8,0+IF(C4=\"FL3\",8,0+IF(C4=\"FL4\",8,0+IF(C4=\"NBFL\",8,0+IF(C4=\"BIO\",6,0+HVIS))))))","v":{"$error":"#NAME?"}},"=>",{"$f":"A4","v":0},null,{"$f":"I4","v":0},"nætter"]
[{"$f":"'Vær del.'!A40:B40","v":0},null,{"$f":"'Vær del.'!D40","v":0},{"$f":"'Vær del.'!E40","v":0},{"$f":"IF(C5=\"FV\",400,0)+IF(C5=\"FL2\",500,0)+IF(C5=\"FL3\",650,0)+IF(C5=\"FL4\",800,0)+IF(C5=\"BIO\",400,0)+IF(C5=\"NBFL\",500,0)","v":0},{"$f":"'Vær del.'!F40","v":"00:00:00"},null,{"$f":"'Vær del.'!G40","v":"00:00:00"},0,null,0,0,{"$f":"VLOOKUP(Fakturering!I5,'opslag slet ikke'!$A$2:$S$361,IF(Fakturering!C5=\"FV\",\"4\",IF(Fakturering!C5=\"FL2\",\"7\",IF(Fakturering!C5=\"FL3\",\"10\",IF(Fakturering!C5=\"FL4\",\"13\",IF(Fakturering!C5=\"NBFL\",\"16\",IF(Fakturering!C5=\"BIO\",\"19\",\"0\")))))),FALSE)","v":{"$error":"#N/A"}},{"$error":"#N/A"},"Kredit:",2110,"/",84,"-","0",{"$f":"IF(C5=\"FV\",8,0+IF(C5=\"FL2\",8,0+IF(C5=\"FL3\",8,0+IF(C5=\"FL4\",8,0+IF(C5=\"NBFL\",8,0+IF(C5=\"BIO\",6,0))))))","v":0},"=>",0,null,0,"nætter"]
[{"$f":"'Vær del.'!A41:B41","v":0},null,{"$f":"'Vær del.'!D41","v":0},{"$f":"'Vær del.'!E41","v":0},0,{"$f":"'Vær del.'!F41","v":"00:00:00"},null,{"$f":"'Vær del.'!G41","v":"00:00:00"},0,null,0,0,{"$f":"VLOOKUP(Fakturering!I6,'opslag slet ikke'!$A$2:$S$361,IF(Fakturering!C6=\"FV\",\"4\",IF(Fakturering!C6=\"FL2\",\"7\",IF(Fakturering!C6=\"FL3\",\"10\",IF(Fakturering!C6=\"FL4\",\"13\",IF(Fakturering!C6=\"NBFL\",\"16\",IF(Fakturering!C6=\"BIO\",\"19\",\"0\")))))),FALSE)","v":{"$error":"#N/A"}},{"$error":"#N/A"},"Kredit:",2110,"/",84,"-","0",0,"=>",0,null,0,"nætter"]
[{"$f":"'Vær del.'!A42:B42","v":0},null,{"$f":"'Vær del.'!D42","v":0},{"$f":"'Vær del.'!E42","v":0},0,{"$f":"'Vær del.'!F42","v":"00:00:00"},null,{"$f":"'Vær del.'!G42","v":"00:00:00"},0,null,0,0,{"$f":"VLOOKUP(Fakturering!I7,'opslag slet ikke'!$A$2:$S$361,IF(Fakturering!C7=\"FV\",\"4\",IF(Fakturering!C7=\"FL2\",\"7\",IF(Fakturering!C7=\"FL3\",\"10\",IF(Fakturering!C7=\"FL4\",\"13\",IF(Fakturering!C7=\"NBFL\",\"16\",IF(Fakturering!C7=\"BIO\",\"19\",\"0\")))))),FALSE)","v":{"$error":"#N/A"}},{"$error":"#N/A"},"Kredit:",2110,"/",84,"-","0",0,"=>",0,null,0,"nætter"]
[{"$f":"'Vær del.'!A43:B43","v":0},null,{"$f":"'Vær del.'!D43","v":0},{"$f":"'Vær del.'!E43","v":0},0,{"$f":"'Vær del.'!F43","v":"00:00:00"},null,{"$f":"'Vær del.'!G43","v":"00:00:00"},0,null,0,0,{"$f":"VLOOKUP(Fakturering!I8,'opslag slet ikke'!$A$2:$S$361,IF(Fakturering!C8=\"FV\",\"4\",IF(Fakturering!C8=\"FL2\",\"7\",IF(Fakturering!C8=\"FL3\",\"10\",IF(Fakturering!C8=\"FL4\",\"13\",IF(Fakturering!C8=\"NBFL\",\"16\",IF(Fakturering!C8=\"BIO\",\"19\",\"0\")))))),FALSE)","v":{"$error":"#N/A"}},{"$error":"#N/A"},"Kredit:",2110,"/",84,"-","0",0,"=>",0,null,0,"nætter"]
[{"$f":"'Vær del.'!A44:B44","v":0},null,{"$f":"'Vær del.'!D44","v":0},{"$f":"'Vær del.'!E44","v":0},0,{"$f":"'Vær del.'!F44","v":"00:00:00"},null,{"$f":"'Vær del.'!G44","v":"00:00:00"},0,null,0,0,{"$f":"VLOOKUP(Fakturering!I9,'opslag slet ikke'!$A$2:$S$361,IF(Fakturering!C9=\"FV\",\"4\",IF(Fakturering!C9=\"FL2\",\"7\",IF(Fakturering!C9=\"FL3\",\"10\",IF(Fakturering!C9=\"FL4\",\"13\",IF(Fakturering!C9=\"NBFL\",\"16\",IF(Fakturering!C9=\"BIO\",\"19\",\"0\")))))),FALSE)","v":{"$error":"#N/A"}},{"$error":"#N/A"},"Kredit:",2110,"/",84,"-","0",0,"=>",0,null,0,"nætter"]
[{"$f":"'Vær del.'!A45:B45","v":0},null,{"$f":"'Vær del.'!D45","v":0},{"$f":"'Vær del.'!E45","v":0},0,{"$f":"'Vær del.'!F45","v":"00:00:00"},null,{"$f":"'Vær del.'!G45","v":"00:00:00"},0,null,0,0,{"$f":"VLOOKUP(Fakturering!I10,'opslag slet ikke'!$A$2:$S$361,IF(Fakturering!C10=\"FV\",\"4\",IF(Fakturering!C10=\"FL2\",\"7\",IF(Fakturering!C10=\"FL3\",\"10\",IF(Fakturering!C10=\"FL4\",\"13\",IF(Fakturering!C10=\"NBFL\",\"16\",IF(Fakturering!C10=\"BIO\",\"19\",\"0\")))))),FALSE)","v":{"$error":"#N/A"}},{"$error":"#N/A"},"Kredit:",2110,"/",84,"-","0",0,"=>",0,null,0,"nætter"]
[{"$f":"'Vær del.'!A46:B46","v":0},null,{"$f":"'Vær del.'!D46","v":0},{"$f":"'Vær del.'!E46","v":0},0,{"$f":"'Vær del.'!F46","v":"00:00:00"},null,{"$f":"'Vær del.'!G46","v":"00:00:00"},0,null,0,0,{"$f":"VLOOKUP(Fakturering!I11,'opslag slet ikke'!$A$2:$S$361,IF(Fakturering!C11=\"FV\",\"4\",IF(Fakturering!C11=\"FL2\",\"7\",IF(Fakturering!C11=\"FL3\",\"10\",IF(Fakturering!C11=\"FL4\",\"13\",IF(Fakturering!C11=\"NBFL\",\"16\",IF(Fakturering!C11=\"BIO\",\"19\",\"0\")))))),FALSE)","v":{"$error":"#N/A"}},{"$error":"#N/A"},"Kredit:",2110,"/",84,"-","0",0,"=>",0,null,0,"nætter"]
[{"$f":"'Vær del.'!A47:B47","v":0},null,{"$f":"'Vær del.'!D47","v":0},{"$f":"'Vær del.'!E47","v":0},0,{"$f":"'Vær del.'!F47","v":"00:00:00"},null,{"$f":"'Vær del.'!G47","v":"00:00:00"},0,null,0,0,{"$f":"VLOOKUP(Fakturering!I12,'opslag slet ikke'!$A$2:$S$361,IF(Fakturering!C12=\"FV\",\"4\",IF(Fakturering!C12=\"FL2\",\"7\",IF(Fakturering!C12=\"FL3\",\"10\",IF(Fakturering!C12=\"FL4\",\"13\",IF(Fakturering!C12=\"NBFL\",\"16\",IF(Fakturering!C12=\"BIO\",\"19\",\"0\")))))),FALSE)","v":{"$error":"#N/A"}},{"$error":"#N/A"},"Kredit:",2110,"/",84,"-","0",0,"=>",0,null,0,"nætter"]
[{"$f":"'Vær del.'!A48:B48","v":0},null,{"$f":"'Vær del.'!D48","v":0},{"$f":"'Vær del.'!E48","v":0},0,{"$f":"'Vær del.'!F48","v":"00:00:00"},null,{"$f":"'Vær del.'!G48","v":"00:00:00"},0,null,0,0,{"$f":"VLOOKUP(Fakturering!I13,'opslag slet ikke'!$A$2:$S$361,IF(Fakturering!C13=\"FV\",\"4\",IF(Fakturering!C13=\"FL2\",\"7\",IF(Fakturering!C13=\"FL3\",\"10\",IF(Fakturering!C13=\"FL4\",\"13\",IF(Fakturering!C13=\"NBFL\",\"16\",IF(Fakturering!C13=\"BIO\",\"19\",\"0\")))))),FALSE)","v":{"$error":"#N/A"}},{"$error":"#N/A"},"Kredit:",2110,"/",84,"-","0",0,"=>",0,null,0,"nætter"]
["Kantine",null,"Lunch",null,null,"Fra den",null,"Til og med","Helligdag","antal middag"]
[{"$f":"ENG!B74","v":0},null,{"$f":"NETWORKDAYS(ENG!E74,ENG!F74,'Dato slet ikke'!A23+'Dato slet ikke'!A47+'Dato slet ikke'!A78)","v":0},null,{"$f":"IF(C15>0,50,0)","v":0},{"$f":"ENG!E74","v":"00:00:00"},null,{"$f":"ENG!F74","v":"00:00:00"},0,{"$f":"C15-I15","v":0},null,null,null,{"$f":"J15*E15","v":0},"Kredit:",2110,"/",81,"-",0,8,"=>",{"$f":"A15","v":0},null,"Kantine x",{"$f":"J15","v":0}]
[{"$f":"ENG!B75","v":0},null,{"$f":"NETWORKDAYS(ENG!E75,ENG!F75,'Dato slet ikke'!A24+'Dato slet ikke'!A48+'Dato slet ikke'!A79)","v":0},null,0,{"$f":"ENG!E75","v":"00:00:00"},null,{"$f":"ENG!F75","v":"00:00:00"},1,-1,null,null,null,0,"Kredit:",2110,"/",81,"-",0,8,"=>",0,null,"Kantine x",{"$f":"J16","v":-1}]
[{"$f":"ENG!B76","v":0},null,{"$f":"NETWORKDAYS(ENG!E76,ENG!F76,'Dato slet ikke'!A25+'Dato slet ikke'!A49+'Dato slet ikke'!A80)","v":0},null,0,{"$f":"ENG!E76","v":"00:00:00"},null,{"$f":"ENG!F76","v":"00:00:00"},0,0,null,null,null,0,"Kredit:",2110,"/",81,"-",0,8,"=>",0,null,"Kantine x",{"$f":"J6","v":0}]
[{"$f":"ENG!B77","v":0},null,{"$f":"NETWORKDAYS(ENG!E77,ENG!F77,'Dato slet ikke'!A26+'Dato slet ikke'!A50+'Dato slet ikke'!A81)","v":0},null,0,{"$f":"ENG!E77","v":"00:00:00"},null,{"$f":"ENG!F77","v":"00:00:00"},0,0,null,null,null,0,"Kredit:",2110,"/",81,"-",0,8,"=>",0,null,"Kantine x",0]
[{"$f":"ENG!B78","v":0},null,{"$f":"NETWORKDAYS(ENG!E78,ENG!F78,'Dato slet ikke'!A27+'Dato slet ikke'!A51+'Dato slet ikke'!A82)","v":0},null,0,{"$f":"ENG!E78","v":"00:00:00"},null,{"$f":"ENG!F78","v":"00:00:00"},0,0,null,null,null,0,"Kredit:",2110,"/",81,"-",0,8,"=>",0,null,"Kantine x",0]
[{"$f":"ENG!B79","v":0},null,{"$f":"NETWORKDAYS(ENG!E79,ENG!F79,'Dato slet ikke'!A28+'Dato slet ikke'!A52+'Dato slet ikke'!A83)","v":0},null,0,{"$f":"ENG!E79","v":"00:00:00"},null,{"$f":"ENG!F79","v":"00:00:00"},0,0,null,null,null,0,"Kredit:",2110,"/",81,"-",0,8,"=>",0,null,"Kantine x",0]
{"$rows_left_out":13}
{"sheet":"Faktura","index":3,"n_rows":59,"n_cols":10,"rows_kept":59,"cut":false,"hidden":true,"merged":[[5,1,5,2],[51,9,51,11],[54,9,54,11],[15,9,15,11],[12,1,12,4],[12,5,12,6]]}
[]
[null,{"$f":"ENG!B18","v":0}]
[null,{"$f":"ENG!B19","v":0}]
[null,{"$f":"ENG!B20","v":0}]
[null,{"$f":"ENG!B21","v":0},{"$f":"ENG!B22","v":0},null,null,null,null,"Invoice no."]
[null,{"$f":"ENG!B23","v":0},null,null,null,null,null,"Date:"]
[null,{"$f":"ENG!B24","v":0}]
[null,{"$f":"ENG!B25","v":0}]
[null,{"$f":"ENG!B26","v":0}]
[]
[]
[]
[null,"Acommodation on GINR, Booking nr:",null,null,null,{"$f":"'Vær del.'!A5","v":0}]
[]
[]
[null,"days",null,null,null,"from date","to date","DDK",null,"DDK"]
[null,{"$f":"Fakturering!I4","v":0},{"$f":"Fakturering!C4","v":0},{"$f":"Fakturering!A4","v":0},null,{"$f":"ENG!I59","v":"00:00:00"},{"$f":"ENG!J59","v":"00:00:00"},{"$f":"Fakturering!E4","v":0},null,{"$f":"Fakturering!M4","v":{"$error":"#N/A"}}]
[null,{"$f":"Fakturering!I5","v":0},{"$f":"Fakturering!C5","v":0},{"$f":"Fakturering!A5","v":0},null,{"$f":"ENG!I60","v":"00:00:00"},{"$f":"ENG!J60","v":"00:00:00"},{"$f":"Fakturering!E5","v":0},null,{"$f":"Fakturering!M5","v":{"$error":"#N/A"}}]
[null,{"$f":"Fakturering!I6","v":0},{"$f":"Fakturering!C6","v":0},{"$f":"Fakturering!A6","v":0},null,{"$f":"ENG!I61","v":"00:00:00"},{"$f":"ENG!J61","v":"00:00:00"},{"$f":"Fakturering!E6","v":0},null,{"$f":"Fakturering!M6","v":{"$error":"#N/A"}}]
[null,{"$f":"Fakturering!I7","v":0},{"$f":"Fakturering!C7","v":0},{"$f":"Fakturering!A7","v":0},null,{"$f":"ENG!I62","v":"00:00:00"},{"$f":"ENG!J62","v":"00:00:00"},{"$f":"Fakturering!E7","v":0},null,{"$f":"Fakturering!M7","v":{"$error":"#N/A"}}]
{"$rows_left_out":40}
{"sheet":"Dato slet ikke","index":4,"n_rows":637,"n_cols":2,"rows_kept":637,"cut":false,"hidden":true,"merged":[]}
["2018-04-05"]
["2018-04-06"]
["2018-04-07"]
["2018-04-08"]
["2018-04-09"]
["2018-04-10"]
["2018-04-11"]
["2018-04-12"]
["2018-04-13"]
["2018-04-14"]
["2018-04-15"]
["2018-04-16"]
["2018-04-17"]
["2018-04-18"]
["2018-04-19"]
["2018-04-20"]
["2018-04-21"]
["2018-04-22"]
["2018-04-23"]
["2018-04-24"]
{"$rows_left_out":618}
{"sheet":"opslag slet ikke","index":5,"n_rows":365,"n_cols":29,"rows_kept":365,"cut":false,"hidden":true,"merged":[]}
["Dag","FV","opr.pris","Max pris","FL2","opr.pris","Max pris","FL3","opr.pris","Max pris","FL4","opr.pris","Max pris","NBFL","opr.pris","Max pris","BIO","opr.pris","Max pris",null,null,"Type","dag","Maxpris",null,null,null,null,{"$f":"NOW()","v":"2018-08-07T10:14:23.070"}]
[1,400,{"$f":"B2*A2","v":400},{"$f":"C2","v":400},500,{"$f":"E2*A2","v":500},{"$f":"F2","v":500},650,650,{"$f":"I2","v":650},800,{"$f":"K2*A2","v":800},{"$f":"L2","v":800},500,{"$f":"N2*A2","v":500},{"$f":"O2","v":500},500,{"$f":"Q2*A2","v":500},{"$f":"R2","v":500},null,null,null,null,null,null,null,null,null,{"$f":"AC1+1","v":"2018-08-08T10:14:23.070"}]
[2,{"$f":"B2","v":400},{"$f":"B3*A3","v":800},800,{"$f":"E2","v":500},1000,1000,{"$f":"H2","v":650},{"$f":"H3*A3","v":1300},1300,{"$f":"K2","v":800},{"$f":"K3*A3","v":1600},1600,{"$f":"N2","v":500},1000,1000,{"$f":"Q2","v":500},1000,1000,null,null,"FV",10,{"$f":"VLOOKUP(W3,A2:S361,IF(V3=\"FV\",\"4\",IF(V3=\"FL2\",\"7\",IF(V3=\"FL3\",\"10\",IF(V3=\"FL4\",\"13\",IF(V3=\"NBFL\",\"16\",IF(V3=\"BIO\",\"19\",\"0\")))))),FALSE)","v":4000},null,null,null,null,{"$f":"AC2+1","v":"2018-08-09T10:14:23.070"}]
[3,{"$f":"B3","v":400},1200,1200,{"$f":"E3","v":500},1500,1500,{"$f":"H3","v":650},{"$f":"H4*A4","v":1950},1950,{"$f":"K3","v":800},{"$f":"K4*A4","v":2400},2400,{"$f":"N3","v":500},1500,1500,{"$f":"Q3","v":500},1500,1500,null,null,null,null,null,null,null,null,null,"2018-08-10T10:14:23.070"]
[4,400,1600,1600,500,2000,2000,650,2600,2600,800,3200,3200,500,2000,2000,500,2000,2000,null,null,null,null,null,null,null,null,null,"2018-08-11T10:14:23.070"]
[5,400,2000,2000,500,2500,2500,650,3250,3250,800,4000,4000,500,2500,2500,500,2500,2500,null,null,null,null,null,null,null,null,null,"2018-08-12T10:14:23.070"]
[6,400,2400,2400,500,3000,3000,650,3900,3900,800,4800,4800,500,3000,3000,500,3000,3000,null,null,null,null,null,null,null,null,null,"2018-08-13T10:14:23.070"]
[7,400,2800,2800,500,3500,3500,650,4550,4550,800,5600,5600,500,3500,3500,500,3500,3500,null,null,null,null,null,null,null,null,null,"2018-08-14T10:14:23.070"]
[8,400,3200,3200,500,4000,4000,650,5200,5200,800,6400,6400,500,4000,4000,500,4000,4000,null,null,null,null,null,null,null,null,null,"2018-08-15T10:14:23.070"]
[9,400,3600,3600,500,4500,4500,650,5850,5850,800,7200,7200,500,4500,4500,500,4500,4500,null,null,null,null,null,null,null,null,null,"2018-08-16T10:14:23.070"]
[10,400,4000,{"$f":"B11*A11","v":4000},500,5000,{"$f":"E11*A11","v":5000},650,6500,{"$f":"H11*A11","v":6500},800,8000,{"$f":"K11*A11","v":8000},500,5000,5000,500,5000,{"$f":"Q11*A11","v":5000},null,null,null,null,null,null,null,null,null,"2018-08-17T10:14:23.070"]
[11,400,4400,{"$f":"D11","v":4000},500,5500,{"$f":"G11","v":5000},650,7150,{"$f":"J11","v":6500},800,8800,{"$f":"M11","v":8000},500,5500,{"$f":"P11","v":5000},500,5500,{"$f":"S11","v":5000},null,null,null,null,null,null,null,null,null,"2018-08-18T10:14:23.070"]
[12,400,4800,{"$f":"D12","v":4000},500,6000,{"$f":"G12","v":5000},650,7800,{"$f":"J12","v":6500},800,9600,{"$f":"M12","v":8000},500,6000,{"$f":"P12","v":5000},500,6000,{"$f":"S12","v":5000},null,null,null,null,null,null,null,null,null,"2018-08-19T10:14:23.070"]
[13,400,5200,{"$f":"D13","v":4000},500,6500,{"$f":"G13","v":5000},650,8450,{"$f":"J13","v":6500},800,10400,{"$f":"M13","v":8000},500,6500,{"$f":"P13","v":5000},500,6500,{"$f":"S13","v":5000},null,null,null,null,null,null,null,null,null,"2018-08-20T10:14:23.070"]
[14,400,5600,4000,500,7000,5000,650,9100,6500,800,11200,8000,500,7000,5000,500,7000,5000,null,null,null,null,null,null,null,null,null,"2018-08-21T10:14:23.070"]
[15,400,6000,4000,500,7500,5000,650,9750,6500,800,12000,8000,500,7500,5000,500,7500,5000,null,null,"Her er tabel med forkellige max priser.",null,null,null,null,null,null,"2018-08-22T10:14:23.070"]
[16,400,6400,4000,500,8000,5000,650,10400,6500,800,12800,8000,500,8000,5000,500,8000,5000,null,null,null,null,null,null,null,null,null,"2018-08-23T10:14:23.070"]
[17,400,6800,4000,500,8500,5000,650,11050,6500,800,13600,8000,500,8500,5000,500,8500,5000,null,null,"Kolonne A er = dagene",null,null,null,null,null,null,"2018-08-24T10:14:23.070"]
[18,400,7200,4000,500,9000,5000,650,11700,6500,800,14400,8000,500,9000,5000,500,9000,5000,null,null,"Kolonne B, E, H, K, N og Q er = forskellige \"boligtyper\" med priser.",null,null,null,null,null,null,"2018-08-25T10:14:23.070"]
[19,400,7600,4000,500,9500,5000,650,12350,6500,800,15200,8000,500,9500,5000,500,9500,5000,null,null,"Kolonne C, F, I, L, O og R er = oprindelig pris",null,null,null,null,null,null,"2018-08-26T10:14:23.070"]
{"$rows_left_out":345}